{"text_format":"2","workbook":"xlsx","n_sheets":6,"sheets":["1차","2차","전체학교명부","3차 모집 학교_15개교","매칭결과안내문_학교","매칭결과안내문_대학생"],"not_rendered":{"charts":0,"images":0,"macros":0,"external_links":0,"defined_names":2,"comments":1,"pivot_tables":0},"unopened":[],"bounds":{"document_bytes":16777216,"sheet_cells":100000,"run_cost":"one","rows_first":2000,"rows_last":500,"rows_between":2000,"halvings":0,"cell_chars":16384,"cell_head_chars":4096},"cells_cut":0,"cells_raw":0,"read":"whole","date_system":"1900"}

{"sheet":"1차","index":0,"n_rows":452,"n_cols":16,"rows_kept":452,"cut":false,"hidden":true,"merged":[[0,0,0,15]]}
["2015년 대학생과 함께하는 STEAM 1차 매칭결과"]
[]
["순번","지역","학교급","학교명","담당교사","학교 연락처","팀명","구성원","이름","성별","대학","학과","학년","활동기간 중 본인 거주지","거주지역","거리"]
[1,"서울","초","서울갈산초등학교","원윤경","02-2679-7232","푸르미르","팀장","배준혁","남","중앙대학교","전자전기공학부",3,"서울시 동작구","서울","단거리"]
[{"$nulls":7},"팀원","현지영","여","중앙대학교","전자전기공학부",4,"서울시 동작구","서울","단거리"]
[{"$nulls":7},"팀원","심도연","여","중앙대학교","전자전기공학부",4,"서울시 동작구","서울","단거리"]
[{"$nulls":7},"팀원","김윤태","남","중앙대학교","전자전기공학부",3,"성남시 분당구","경기","단거리"]
[{"$nulls":7},"팀원","안태원","남","중앙대학교","전자전기공학부",3,"서울시 양천구","서울","단거리"]
[{"$nulls":7},"팀원","김준영","남","중앙대학교","전자전기공학부",3,"서울시 양천구","서울","단거리"]
[2,"서울","초","서울갈현초등학교","남미선","02-355-0835","새섬&새내기","팀장","김우경","여","한동대학교","상담심리/사회복지 학부",3,"창원시","경남","중/장거리"]
[{"$nulls":7},"팀원","정시은","남","한동대학교","GLS 학부(글로벌 리더십학부)",1,"김해시","경남","중/장거리"]
[{"$nulls":7},"팀원","성해욱","남","한동대학교","GLS 학부(글로벌 리더십학부)",1,"서울시","서울","단거리"]
[{"$nulls":7},"팀원","유화현","여","한동대학교","GLS 학부(글로벌 리더십학부)",1,"전주시","전북","중/장거리"]
[{"$nulls":7},"팀원","민규동","남","한동대학교","GLS 학부(글로벌 리더십학부)",1,"수원시","경기","단거리"]
[{"$nulls":7},"팀원","윤경은","여","한동대학교","GLS 학부(글로벌 리더십학부)",1,"대전시 유성구","대전","중/장거리"]
[3,"서울","초","서울공덕초등학교","정동수","02-703-6069","WRC","팀장","조준상","남","대진대학교","컴퓨터공학과",1,"서울시 노원구","서울","단거리"]
[{"$nulls":7},"팀원","문혜진","여","서강대학교","Art&Technology",1,"서울시 노원구","서울","단거리"]
[{"$nulls":7},"팀원","김정용","남","서울과학기술대학교","기계시스템디자인공학과",1,"서울시 노원구","서울","단거리"]
[{"$nulls":7},"팀원","이정우","남","인덕대학교","컴퓨터전자과",1,"서울시 노원구","서울","단거리"]
[{"$nulls":7},"팀원","김상원","남","세종대학교","기계항공우주공학과",1,"서울시 성동구","서울","단거리"]
[{"$nulls":7},"팀원","이영성","남","경기과학기술대","기계설계과",1,"서울시 도봉구","서울","단거리"]
[4,"서울","초","서울길동초등학교","이강규","02-475-5591(607)","코딧","팀장","이송연","여","숙명여자대학교","멀티미디어과학과",2,"서울시 용산구","서울","단거리"]
[{"$nulls":7},"팀원","박재연","여","숙명여자대학교","멀티미디어과학과",2,"서울시 노원구","서울","단거리"]
[{"$nulls":7},"팀원","유서연","여","숙명여자대학교","멀티미디어과학과",2,"고양시 일산동구","경기","단거리"]
[{"$nulls":7},"팀원","이수연","여","숙명여자대학교","멀티미디어과학과",2,"서울시 서대문구","서울","단거리"]
[{"$nulls":7},"팀원","이하은","여","숙명여자대학교","멀티미디어과학과",2,"경기도 파주시 문산읍","경기","단거리"]
[5,"서울","초","서울당현초등학교","안찬원","02-932-0605","하이스트","팀장","이선미","여","춘천교육대학교","윤리교육과",2,"서울시 노원구","서울","단거리"]
[{"$nulls":7},"팀원","이하기","남","춘천교육대학교","음악교육과",2,"서울시 노원구","서울","단거리"]
[{"$nulls":7},"팀원","김시원","남","춘천교육대학교","컴퓨터교육과",2,"서울 도봉구","서울","단거리"]
[{"$nulls":7},"팀원","차은영","여","춘천교육대학교","윤리교육과",2,"서울시 영등포구","서울","단거리"]
{"$rows_left_out":423}
{"sheet":"2차","index":1,"n_rows":124,"n_cols":27,"rows_kept":124,"cut":false,"hidden":true,"merged":[[0,1,0,25]]}
[null,"2차 매칭(임시)"]
[]
[null,"순번","지역","학교급","학교명","학교주소","운영날짜","수업내용(관련 대학생 전공)","수업학년","수혜학생 실력","희망 대학생 성별","담당교사","학교 연락처","수혜학생 총 수","팀명","구성원","이름","성별","대학","학과","학년","생년월일","연락처(휴대폰)","활동기간 중 \n본인 거주지","단거리/중거리/장거리","2순위","거리"]
[null,1,"서울","고","신일고등학교","서울시 강북구 미아동 솔매로 49","9. 14 ~ 18","매체와 표현, 태양전지와 광물자원, 나선을 이용한 풍력발전기, 화학모형 제작(수학, 과학일반, 화학, 미술)","1학년","중","상관없음","이윤민","010-6313-3074",70,"두부머리","팀장","김동하","남","서울과학\n기술대학교","신소재공학과",2,"95.11.3","010-2521-1487","서울시 강북구","서울","신일고",{"$f":"IF(Y4=$C$4,\"단거리\",\"중/장거리\")","v":"단거리"}]
[{"$nulls":15},"팀원","김태호","남","경희대학교","산업경영공학과",1,"95.11.21","010-9976-3600","수원시 영통구","서울","신일고",{"$f":"IF(Y5=$C$4,\"단거리\",\"중/장거리\")","v":"단거리"}]
[{"$nulls":15},"팀원","강상윤","남","광운대학교","전자융합공학과",1,"96.2.27","010-8521-7510","서울시 강북구","서울","신일고","단거리"]
[{"$nulls":15},"팀원","하정연","남","중앙대학교","에너지시스템공학과",1,"96.1.24","010-3162-7786","서울시 성북구","서울","신일고","단거리"]
[{"$nulls":15},"팀원","이미애","여","광운대학교","환경공학과",2,"95.6.28","010-8005-2413","서울시 강북구","서울","신일고","단거리"]
[{"$nulls":15},"팀원","심정환","남","국민대학교","빅데이터경영통계학과",2,"95.8.14","010-4919-9729","서울시 강북구","서울","신일고","단거리"]
[null,2,"대구","초","대구도림초등학교","대구광역시 달성군 다사읍 서재로26길 94(서재리 32)","9. 7 ~ 11","날씨와 우리생활, 물체의 빠르기,식물의 구조와 기능, 디자인 (생물교육, 물리학, 디자인학과학, 과학교육 전공 학과)","5학년","중","상관없음","채원곤","010-5156-9403",88,"보글보글","팀장","임지수","여","대구교육대학교","초등교육과(과학심화전공)",2,"95.09.05","010-5912-8703","대구시 남구","대구","경일여고",{"$f":"IF(Y10=$C$10,\"단거리\",\"중/장거리\")","v":"단거리"}]
[{"$nulls":15},"팀원","김아영","여","대구교육대학교","초등교육과(과학심화전공)",2,"92.11.23","010-6676-9096","대구시 남구","대구","경일여고",{"$f":"IF(Y11=$C$10,\"단거리\",\"중/장거리\")","v":"단거리"}]
[{"$nulls":15},"팀원","이어진","여","대구교육대학교","초등교육과(과학심화전공)",2,"96.01.07","010-2367-0354","대구시 남구","대구","경일여고","단거리"]
[{"$nulls":15},"팀원","이지은","여","대구교육대학교","초등교육과(과학심화전공)",2,"93.07.07","010-8831-9707","대구시 수성구","대구","경일여고","단거리"]
[{"$nulls":15},"팀원","최가영","여","대구교육대학교","초등교육과(과학심화전공)",2,"95.06.20","010-9860-0978","대구시 남구","대구","경일여고","단거리"]
[{"$nulls":15},"팀원","박현준","남","대구교육대학교","초등교육과(실과심화전공)",2,"95.12.10","010-5120-5897","대구시 달서구","대구","경일여고","단거리"]
[null,3,"대구","고","강북고등학교","대구광역시 북구 태전로 100","10. 19 ~ 23","산화와 환원, 산-염기 지시약(화학, 화학교육, 화학공학 등 화학 관련 학과)","2학년","중상","상관없음","김현경","010-7650-6833",98]
[null,4,"대구","고","경일여자고등학교","대구시 남구 효성로 37(봉덕동)","8.12 ~ 9.9 까지 매주 수요일","한반도 지형의 심미적 감상 (지구과학, 국어, 음악, 미술 전공 학과)","1학년","상","상관없음","이경제","010-6421-9515","신청자들","피노키오","팀장","박정광","남","경북대학교","전자공학부",3,"1993-02-14","010-3526-4579","대구시 대현동","대구","경일여고",{"$f":"IF(Y17=$C$17,\"단거리\",\"중/장거리\")","v":"단거리"}]
[{"$nulls":15},"팀원","서진교","남","경북대학교","전자공학부",2,"1993-11-02","010-3354-4635","대구시 이곡동","대구","경일여고",{"$f":"IF(Y18=$C$17,\"단거리\",\"중/장거리\")","v":"단거리"}]
[{"$nulls":15},"팀원","이주헌","남","경북대학교","전자공학부",3,"1993-02-28","010-6778-2929","대구시 산격동","대구","경일여고","단거리"]
[{"$nulls":15},"팀원","홍헌우","남","경북대학교","전자공학부",3,"1991-03-27","010-6707-7500","대구시 읍내동","대구","경일여고","단거리"]
[{"$nulls":15},"팀원","서어진","여","경북대학교","전자공학부",3,"1993-10-08","010-2901-1008","대구시 대현동","대구","경일여고","단거리"]
[{"$nulls":15},"팀원","정연태","남","경북대학교","전자공학부",2,"1993-05-14","010-2510-7366","대구시 봉덕동","대구","경일여고","단거리"]
[null,5,"광주","초","도산초등학교","광주광역시 광산구 송저외로 6","9. 7 ~ 11","LED Art- 명화의 재탄생, 식물공장, 아두이노 프로그램(생명전공학과,  컴퓨터나 전산과)","5학년","중하","상관없음","김은하","010-4603-0668",75]
[null,6,"광주","초","광주교대부설초등학교","광주광역시 북구 필문대로 55","9. 7 ~ 11","녹색에너지, 자연 프로그램 개발(생명공학, 생물교육, 숲 체험)","2학년","중상","상관없음","최재은","010-9443-0717(통화중)",96]
[null,7,"대전","고","대전동산고등학교","대전광역시 중구 문화로 183(문화동)","9. 7 ~ 11","태양전지와 광물자원 (물리학, 물리교육, 기타 물리 전공 학과)","1학년","중","상관없음","홍석균","010-6368-3014(무응답)",150,"성모짱","팀장","윤지혜","여","한밭대학교","신소재공학과",2,"95.05.06","010-7710-4556","대전 서구","대전",null,{"$f":"IF(Y25=$C$25,\"단거리\",\"중/장거리\")","v":"단거리"}]
[{"$nulls":15},"팀원","전채리","여","충남대학교","응용화학공학과",1,"95.05.03","010-2506-9553","대전 동구","대전",null,{"$f":"IF(Y26=$C$25,\"단거리\",\"중/장거리\")","v":"단거리"}]
[{"$nulls":15},"팀원","김재린","여","한밭대학교","정보통신공학과",2,"95.08.21","010-9351-8839","대전 대덕구","대전",null,"단거리"]
[{"$nulls":15},"팀원","김소희","여","충남대학교","미생물분자생명과학과",1,"95.04.28","010-7232-3116","대전 중구","대전",null,"단거리"]
[{"$nulls":15},"팀원","강예지","여","한밭대학교","정보통신공학과",2,"95.09.11","010-3020-9744","대전 대덕구","대전",null,"단거리"]
[{"$nulls":15},"팀원","조호정","여","대전대학교","간호학과",2,"95.12.11","010-2308-2853","대전 서구","대전",null,"단거리"]
{"$rows_left_out":95}
{"sheet":"전체학교명부","index":2,"n_rows":111,"n_cols":12,"rows_kept":111,"cut":false,"hidden":true,"merged":[]}
["시도","학교명",null,null,"대학생팀명","학교명","담당교사","연락처","학교주소","팀장","대학","연락처"]
["서울","서울갈산초등학교",{"$f":"COUNTIF('3차 모집 학교_15개교'!$E$4:$E$18,전체학교명부!B2)","v":0},null,"푸르미르","서울갈산초등학교",{"$f":"VLOOKUP(F2,#REF!,2,FALSE)","v":{"$error":"#REF!"}},{"$f":"VLOOKUP(F2,#REF!,4,FALSE)","v":{"$error":"#REF!"}},{"$f":"VLOOKUP(F2,'2차'!$E$3:$F$106,2,FALSE)","v":{"$error":"#N/A"}},"배준혁","중앙대학교",0]
["서울","서울갈현초등학교",{"$f":"COUNTIF('3차 모집 학교_15개교'!$E$4:$E$18,전체학교명부!B3)","v":0},null,"새섬&새내기","서울갈현초등학교",{"$f":"VLOOKUP(F3,#REF!,2,FALSE)","v":{"$error":"#REF!"}},{"$f":"VLOOKUP(F3,#REF!,4,FALSE)","v":{"$error":"#REF!"}},{"$f":"VLOOKUP(F3,'2차'!$E$3:$F$106,2,FALSE)","v":{"$error":"#N/A"}},"김우경","한동대학교",0]
["서울","서울공덕초등학교",{"$f":"COUNTIF('3차 모집 학교_15개교'!$E$4:$E$18,전체학교명부!B4)","v":0},null,"WRC","서울공덕초등학교",{"$f":"VLOOKUP(F4,#REF!,2,FALSE)","v":{"$error":"#REF!"}},{"$f":"VLOOKUP(F4,#REF!,4,FALSE)","v":{"$error":"#REF!"}},{"$f":"VLOOKUP(F4,'2차'!$E$3:$F$106,2,FALSE)","v":{"$error":"#N/A"}},"조준상","대진대학교",0]
["서울","서울길동초등학교",{"$f":"COUNTIF('3차 모집 학교_15개교'!$E$4:$E$18,전체학교명부!B5)","v":0},null,"코딧","서울길동초등학교",{"$f":"VLOOKUP(F5,#REF!,2,FALSE)","v":{"$error":"#REF!"}},{"$f":"VLOOKUP(F5,#REF!,4,FALSE)","v":{"$error":"#REF!"}},{"$f":"VLOOKUP(F5,'2차'!$E$3:$F$106,2,FALSE)","v":{"$error":"#N/A"}},"이송연","숙명여자대학교",0]
["서울","서울당현초등학교",{"$f":"COUNTIF('3차 모집 학교_15개교'!$E$4:$E$18,전체학교명부!B6)","v":0},null,"하이스트","서울당현초등학교",{"$f":"VLOOKUP(F6,#REF!,2,FALSE)","v":{"$error":"#REF!"}},{"$f":"VLOOKUP(F6,#REF!,4,FALSE)","v":{"$error":"#REF!"}},{"$f":"VLOOKUP(F6,'2차'!$E$3:$F$106,2,FALSE)","v":{"$error":"#N/A"}},"이선미","춘천교육대학교",0]
["서울","서울면동초등학교",{"$f":"COUNTIF('3차 모집 학교_15개교'!$E$4:$E$18,전체학교명부!B7)","v":0},null,"S-TEAM","서울면동초등학교",{"$f":"VLOOKUP(F7,#REF!,2,FALSE)","v":{"$error":"#REF!"}},{"$f":"VLOOKUP(F7,#REF!,4,FALSE)","v":{"$error":"#REF!"}},{"$f":"VLOOKUP(F7,'2차'!$E$3:$F$106,2,FALSE)","v":{"$error":"#N/A"}},"이홍주","서울교육대학교",0]
["서울","서울명덕초등학교",{"$f":"COUNTIF('3차 모집 학교_15개교'!$E$4:$E$18,전체학교명부!B8)","v":0},null,"Aerotaract","서울명덕초등학교",{"$f":"VLOOKUP(F8,#REF!,2,FALSE)","v":{"$error":"#REF!"}},{"$f":"VLOOKUP(F8,#REF!,4,FALSE)","v":{"$error":"#REF!"}},{"$f":"VLOOKUP(F8,'2차'!$E$3:$F$106,2,FALSE)","v":{"$error":"#N/A"}},"강다솜","한국항공대학교",0]
["서울","서울불암초등학교",{"$f":"COUNTIF('3차 모집 학교_15개교'!$E$4:$E$18,전체학교명부!B9)","v":0},null,"난선생이고넌제자야","서울불암초등학교",{"$f":"VLOOKUP(F9,#REF!,2,FALSE)","v":{"$error":"#REF!"}},{"$f":"VLOOKUP(F9,#REF!,4,FALSE)","v":{"$error":"#REF!"}},{"$f":"VLOOKUP(F9,'2차'!$E$3:$F$106,2,FALSE)","v":{"$error":"#N/A"}},"김진","한국외국어대학교 글로벌캠퍼스",0]
["서울","서울용산초등학교",{"$f":"COUNTIF('3차 모집 학교_15개교'!$E$4:$E$18,전체학교명부!B10)","v":0},null,"Win-win","서울용산초등학교",{"$f":"VLOOKUP(F10,#REF!,2,FALSE)","v":{"$error":"#REF!"}},{"$f":"VLOOKUP(F10,#REF!,4,FALSE)","v":{"$error":"#REF!"}},{"$f":"VLOOKUP(F10,'2차'!$E$3:$F$106,2,FALSE)","v":{"$error":"#N/A"}},"연다정","한국외국어대학교",0]
["서울","서울장충초등학교",{"$f":"COUNTIF('3차 모집 학교_15개교'!$E$4:$E$18,전체학교명부!B11)","v":0},null,"열정갑","서울장충초등학교",{"$f":"VLOOKUP(F11,#REF!,2,FALSE)","v":{"$error":"#REF!"}},{"$f":"VLOOKUP(F11,#REF!,4,FALSE)","v":{"$error":"#REF!"}},{"$f":"VLOOKUP(F11,'2차'!$E$3:$F$106,2,FALSE)","v":{"$error":"#N/A"}},"윤인수","한양대학교",0]
["부산","사남초등학교",{"$f":"COUNTIF('3차 모집 학교_15개교'!$E$4:$E$18,전체학교명부!B12)","v":0},null,"열정! 영맨~","사남초등학교",{"$f":"VLOOKUP(F12,#REF!,2,FALSE)","v":{"$error":"#REF!"}},{"$f":"VLOOKUP(F12,#REF!,4,FALSE)","v":{"$error":"#REF!"}},{"$f":"VLOOKUP(F12,'2차'!$E$3:$F$106,2,FALSE)","v":{"$error":"#N/A"}},"유건우","부산대학교",0]
["부산","상당초등학교",{"$f":"COUNTIF('3차 모집 학교_15개교'!$E$4:$E$18,전체학교명부!B13)","v":0},null,"식스팀(Six Team)","상당초등학교",{"$f":"VLOOKUP(F13,#REF!,2,FALSE)","v":{"$error":"#REF!"}},{"$f":"VLOOKUP(F13,#REF!,4,FALSE)","v":{"$error":"#REF!"}},{"$f":"VLOOKUP(F13,'2차'!$E$3:$F$106,2,FALSE)","v":{"$error":"#N/A"}},"이채민","동아대학교",0]
["부산","천마초등학교",{"$f":"COUNTIF('3차 모집 학교_15개교'!$E$4:$E$18,전체학교명부!B14)","v":0},null,"도담도담","천마초등학교",{"$f":"VLOOKUP(F14,#REF!,2,FALSE)","v":{"$error":"#REF!"}},{"$f":"VLOOKUP(F14,#REF!,4,FALSE)","v":{"$error":"#REF!"}},{"$f":"VLOOKUP(F14,'2차'!$E$3:$F$106,2,FALSE)","v":{"$error":"#N/A"}},"노민우","부산교육대학교",0]
["대구","대구도림초등학교",{"$f":"COUNTIF('3차 모집 학교_15개교'!$E$4:$E$18,전체학교명부!B15)","v":0},null,"보글보글","대구도림초등학교",{"$f":"VLOOKUP(F15,#REF!,2,FALSE)","v":{"$error":"#REF!"}},{"$f":"VLOOKUP(F15,#REF!,4,FALSE)","v":{"$error":"#REF!"}},{"$f":"VLOOKUP(F15,'2차'!$E$3:$F$106,2,FALSE)","v":"대구광역시 달성군 다사읍 서재로26길 94(서재리 32)"},"임지수","대구교육대학교","010-5912-8703"]
["대구","대구장기초등학교",{"$f":"COUNTIF('3차 모집 학교_15개교'!$E$4:$E$18,전체학교명부!B16)","v":0},null,"애교지존","대구장기초등학교",{"$f":"VLOOKUP(F16,#REF!,2,FALSE)","v":{"$error":"#REF!"}},{"$f":"VLOOKUP(F16,#REF!,4,FALSE)","v":{"$error":"#REF!"}},{"$f":"VLOOKUP(F16,'2차'!$E$3:$F$106,2,FALSE)","v":{"$error":"#N/A"}},"신용길","경북대학교",0]
["대구","대구지묘초등학교",{"$f":"COUNTIF('3차 모집 학교_15개교'!$E$4:$E$18,전체학교명부!B17)","v":0},null,"E.E.E","대구지묘초등학교",{"$f":"VLOOKUP(F17,#REF!,2,FALSE)","v":{"$error":"#REF!"}},{"$f":"VLOOKUP(F17,#REF!,4,FALSE)","v":{"$error":"#REF!"}},{"$f":"VLOOKUP(F17,'2차'!$E$3:$F$106,2,FALSE)","v":{"$error":"#N/A"}},"주휘성","경북대학교",0]
["광주","도산초등학교",{"$f":"COUNTIF('3차 모집 학교_15개교'!$E$4:$E$18,전체학교명부!B18)","v":0},null,0,"도산초등학교",{"$f":"VLOOKUP(F18,#REF!,2,FALSE)","v":{"$error":"#REF!"}},{"$f":"VLOOKUP(F18,#REF!,4,FALSE)","v":{"$error":"#REF!"}},{"$f":"VLOOKUP(F18,'2차'!$E$3:$F$106,2,FALSE)","v":"광주광역시 광산구 송저외로 6"},0,0,0]
["광주","광주교대부설초등학교",{"$f":"COUNTIF('3차 모집 학교_15개교'!$E$4:$E$18,전체학교명부!B19)","v":1},null,0,"광주교대부설초등학교",{"$f":"VLOOKUP(F19,#REF!,2,FALSE)","v":{"$error":"#REF!"}},{"$f":"VLOOKUP(F19,#REF!,4,FALSE)","v":{"$error":"#REF!"}},{"$f":"VLOOKUP(F19,'2차'!$E$3:$F$106,2,FALSE)","v":"광주광역시 북구 필문대로 55"},0,0,0]
["대전","대전갑천초등학교",{"$f":"COUNTIF('3차 모집 학교_15개교'!$E$4:$E$18,전체학교명부!B20)","v":0},null,"와야","대전갑천초등학교",{"$f":"VLOOKUP(F20,#REF!,2,FALSE)","v":{"$error":"#REF!"}},{"$f":"VLOOKUP(F20,#REF!,4,FALSE)","v":{"$error":"#REF!"}},{"$f":"VLOOKUP(F20,'2차'!$E$3:$F$106,2,FALSE)","v":{"$error":"#N/A"}},"신현정","충주교육대학교",0]
["대전","대전금동초등학교",{"$f":"COUNTIF('3차 모집 학교_15개교'!$E$4:$E$18,전체학교명부!B21)","v":0},null,"AcTive","대전금동초등학교",{"$f":"VLOOKUP(F21,#REF!,2,FALSE)","v":{"$error":"#REF!"}},{"$f":"VLOOKUP(F21,#REF!,4,FALSE)","v":{"$error":"#REF!"}},{"$f":"VLOOKUP(F21,'2차'!$E$3:$F$106,2,FALSE)","v":{"$error":"#N/A"}},"윤영섭","충남대학교",0]
["대전","학하초등학교",{"$f":"COUNTIF('3차 모집 학교_15개교'!$E$4:$E$18,전체학교명부!B22)","v":0},null,"디딤돌","학하초등학교",{"$f":"VLOOKUP(F22,#REF!,2,FALSE)","v":{"$error":"#REF!"}},{"$f":"VLOOKUP(F22,#REF!,4,FALSE)","v":{"$error":"#REF!"}},{"$f":"VLOOKUP(F22,'2차'!$E$3:$F$106,2,FALSE)","v":{"$error":"#N/A"}},"이승종","한국과학기술원",0]
["대전","진잠초등학교",{"$f":"COUNTIF('3차 모집 학교_15개교'!$E$4:$E$18,전체학교명부!B23)","v":0},null,"칵테일","진잠초등학교",{"$f":"VLOOKUP(F23,#REF!,2,FALSE)","v":{"$error":"#REF!"}},{"$f":"VLOOKUP(F23,#REF!,4,FALSE)","v":{"$error":"#REF!"}},{"$f":"VLOOKUP(F23,'2차'!$E$3:$F$106,2,FALSE)","v":{"$error":"#N/A"}},"박지수","우송대학교",0]
["경기","연서초등학교",{"$f":"COUNTIF('3차 모집 학교_15개교'!$E$4:$E$18,전체학교명부!B24)","v":0},null,"전달","연서초등학교",{"$f":"VLOOKUP(F24,#REF!,2,FALSE)","v":{"$error":"#REF!"}},{"$f":"VLOOKUP(F24,#REF!,4,FALSE)","v":{"$error":"#REF!"}},{"$f":"VLOOKUP(F24,'2차'!$E$3:$F$106,2,FALSE)","v":"경기도 광명시 안현로 80-2"},"이상미","서울과학기술대학교","010-3118-0875"]
["경기","갈곶초등학교",{"$f":"COUNTIF('3차 모집 학교_15개교'!$E$4:$E$18,전체학교명부!B25)","v":0},null,"비타민","갈곶초등학교",{"$f":"VLOOKUP(F25,#REF!,2,FALSE)","v":{"$error":"#REF!"}},{"$f":"VLOOKUP(F25,#REF!,4,FALSE)","v":{"$error":"#REF!"}},{"$f":"VLOOKUP(F25,'2차'!$E$3:$F$106,2,FALSE)","v":{"$error":"#N/A"}},"최미현","단국대학교",0]
["경기","곡정초등학교",{"$f":"COUNTIF('3차 모집 학교_15개교'!$E$4:$E$18,전체학교명부!B26)","v":0},null,"영락","곡정초등학교",{"$f":"VLOOKUP(F26,#REF!,2,FALSE)","v":{"$error":"#REF!"}},{"$f":"VLOOKUP(F26,#REF!,4,FALSE)","v":{"$error":"#REF!"}},{"$f":"VLOOKUP(F26,'2차'!$E$3:$F$106,2,FALSE)","v":"경기도 수원시 권선구 권선동 242-3번지"},"서태희","단국대","010-6471-2007"]
["경기","광주매곡초등학교",{"$f":"COUNTIF('3차 모집 학교_15개교'!$E$4:$E$18,전체학교명부!B27)","v":0},null,"시리우스","광주매곡초등학교",{"$f":"VLOOKUP(F27,#REF!,2,FALSE)","v":{"$error":"#REF!"}},{"$f":"VLOOKUP(F27,#REF!,4,FALSE)","v":{"$error":"#REF!"}},{"$f":"VLOOKUP(F27,'2차'!$E$3:$F$106,2,FALSE)","v":{"$error":"#N/A"}},"김정삼","충북대학교",0]
["경기","군포양정초등학교",{"$f":"COUNTIF('3차 모집 학교_15개교'!$E$4:$E$18,전체학교명부!B28)","v":0},null,"견우와직녀","군포양정초등학교",{"$f":"VLOOKUP(F28,#REF!,2,FALSE)","v":{"$error":"#REF!"}},{"$f":"VLOOKUP(F28,#REF!,4,FALSE)","v":{"$error":"#REF!"}},{"$f":"VLOOKUP(F28,'2차'!$E$3:$F$106,2,FALSE)","v":"경기도 군포시 오금로 131"},"김주훈","동국대","010-4323-0847"]
["경기","독정초등학교",{"$f":"COUNTIF('3차 모집 학교_15개교'!$E$4:$E$18,전체학교명부!B29)","v":0},null,"스티므잡스","독정초등학교",{"$f":"VLOOKUP(F29,#REF!,2,FALSE)","v":{"$error":"#REF!"}},{"$f":"VLOOKUP(F29,#REF!,4,FALSE)","v":{"$error":"#REF!"}},{"$f":"VLOOKUP(F29,'2차'!$E$3:$F$106,2,FALSE)","v":"경기도 용인시 기흥구 보정로 100"},"남정웅","중앙대학교","010-2298-8846"]
["경기","새금초등학교",{"$f":"COUNTIF('3차 모집 학교_15개교'!$E$4:$E$18,전체학교명부!B30)","v":1},null,0,"새금초등학교",{"$f":"VLOOKUP(F30,#REF!,2,FALSE)","v":{"$error":"#REF!"}},{"$f":"VLOOKUP(F30,#REF!,4,FALSE)","v":{"$error":"#REF!"}},{"$f":"VLOOKUP(F30,'2차'!$E$3:$F$106,2,FALSE)","v":"경기도 파주시 후곡로 104"},0,0,0]
{"$rows_left_out":82}
{"sheet":"3차 모집 학교_15개교","index":3,"n_rows":29,"n_cols":12,"rows_kept":29,"cut":false,"hidden":false,"merged":[[0,0,0,11]]}
["2015년 대학생과 함께하는 STEAM 운영학교 리스트(15개교)"]
[]
["순번","지역","학교급","학교연락처","학교명","학교주소","운영날짜","수업내용(관련 대학생 전공)","수업학년","수혜학생 실력","희망 대학생 성별","수혜학생 총 수"]
[1,"광주","초","062-520-4363","광주교대부설초등학교","광주광역시 북구 필문대로 55","11.9~12.11\n12.7 제외(기말고사)","녹색 에너지 만들어요!\n-숲 체험하기\n-식물에 대해 탐구해요!\n-에너지 활용 사례 알아보기\n-녹색 에너지 활용 방안 알아보기\n-우리 생활에서 활용할 수 있는 에너지 만들어 보기\n자연을 디자인해요!\n-자연의 모습 그려보기\n-자연을 활용하여 우리 생활에 쓸 수 있는 물건 알아보기\n-자연의 모습을 활용한 디자인 살펴보기\n-자연을 활용한 물건 만들기","2학년","중상","상관없음","96명"]
[2,"경기","초","031-957-5905","새금초등학교","경기도 파주시 후곡로 104","11.30~12.4","에너지, 지층화석,공룡(지구, 화학, 생물, 물리 기타 ) \n※ 변경될 수 있음","4,6학년","중","여","240명"]
[3,"경기","초","031-632-7006","신둔초등학교","경기 이천시 신둔면 경충대로 3150번길 82-3","12.7, 12.9, 12.11, 12.14, 12.15","나는 무대 디자이너, 거북이 롤러코스터 만들기","5학년","중","상관없음","50명"]
[4,"경기","중","031-958-0789","법원여자중학교","경기도 파주시 법원읍 자운서원로 31번","12.18~12.24","1. 안전한 다리 만들기(1학년)\n2. 청진기 설계도 작성 및 청진기 만들기(2학년)\n3. 나만의 공포캐릭터 제작하기(3학년)","1,2,3학년","하","남, 여","125명"]
[5,"경기","중","031-489-9747","양지중학교","경기도 안산시 단원구 안산천 남로 119","12.18~12.24","배 만들기(과학/기술), 에어서핑 비행기 만들기(과학/기술/미술), 체세포 복제 생명기술(과학/기술/미술)\n※ 변경될 수 있음","1,2학년 전체","중","상관없음","60명"]
[6,"경기","중","031-958-4372","어유중학교","경기도 파주시 율곡로 2875","12.14~12.18","창의적 자가발전기(물리)","1,2,3학년","중하","상관없음","23명"]
[7,"강원","초","033-370-3107","영월초등학교","강원도 영월군 영월읍 하송안길 100","12.7-11","롤러코스터 만들기 (과학 단원 : 물체의 빠르기) (건축 공학 전공),  마리오네트 인형극 만들기 (과학단원 : 우리 몸의 구조와 기능)\n※ 변경될 수 있음","5학년","중","상관없음","160명"]
[8,"강원","고","033-581-5911","태백기계공업고등학교","강원도 태백시 평화길 8-24 (장성동)","12.14~12.18","수질 정수 방법, 자기발전을 이용한 자동차 만들기\n※ 변경될 수 있음","1,2학년","중하","상관없음","1학년 : 약 70명\n2학년 : 약 70명"]
[9,"충남","초","041-951-3151","기산초등학교","충남 서천군 기산면 기산길 108","12.14-12.18","소중한 나의 몸, 신체 부위별로 합체하기, 그림자는 내친구, 나는 생태탐사 전문가, 바이오 환경 전문가 등\n※ 변경될 수 있음","1,2,3,4,5,6학년 "," 상11명,  중21명,  하6명","상관없음","38명"]
[10,"충남","중","041-542-1139","신창중학교","아산시 신창면 서부남로 667번길 70","12.21~12.24","현미경 속 세상을 통한 이야기, 움직이는 그림을 통한 열과 우리생활 표현하기(생물, 미술, 과학)","1,2,3학년","중","남, 여","189명"]
[11,"경북","초","054-553-7212","호계초등학교","경북 문경시 호계면 막곡길 16","12.14~12.19\n(조정가능)","융합교육관련이면 다 좋습니다.","1~6학년","중","상관없음","62명"]
[12,"경남","초","055-337-7402","삼방초등학교","경상남도 김해시 삼안로 235번길 20 삼방초등학교","12.7-12.11","LED 전구로 나만의 조명 만들기 , 태양광으로 움직이는 물체 만들기 , 테마가 있는 마을 꾸미기(물리 및 에너지 전공 학과, 건축분야관련)","6학년","중","남, 여","163명"]
[13,"경남","초","055-323-4004","수남초등학교","경남 김해시 율하2로 183","12.7~12.11","용액의 농도, 생태계 보호를 위한 환경 프로젝트 운영\n※ 변경될 수 있음","6학년","중","상관없음","140명"]
[14,"경남","초","055-232-9572","호계초등학교","경남 창원시 마산회원구 내서읍 호계리 광려천북로 182","12.14~12.18","태양열조리기, 신재생에너지 활용하기 (환경에너지 전공 학과)","6학년","보통","남, 여 구분 없이 적정비율","275명"]
[15,"경남","고","055-260-1957","창원여자고등학교","창원시 성남구 두대로 153","12.16~12.18","태양광자동차 만들기, 화학전지 등(물리,화학,지구과학 관련)","고2","중~중상","상관없음","118명"]
[{"$f":"IF(B19=\"\",\"\",ROW()-3)","v":""}]
[""]
[""]
{"$rows_empty":7}
[{"$f":"IF(B29=\"\",\"\",ROW()-39)","v":""}]

{"sheet":"매칭결과안내문_학교","index":4,"n_rows":13,"n_cols":11,"rows_kept":13,"cut":false,"hidden":true,"merged":[]}
["안녕하세요."]
["한국과학창의재단 입니다. 저희 재단에 대한 관심과 지원에 먼저 감사드립니다."]
["2015년 대학생과 함께하는 STEAM의 대학생 팀 선정 결과를 말씀드리겠습니다."]
[{"$nulls":9},"학교명","연락처"]
["1)","팀명 :",{"$f":"VLOOKUP($J$5,전체학교명부!$B$1:$L$111,4,FALSE)","v":"TOP"},{"$nulls":6},"남이초등학교",{"$f":"VLOOKUP(J5,#REF!,4,FALSE)","v":{"$error":"#REF!"}}]
["2)","팀장 :",{"$f":"VLOOKUP($J$5,전체학교명부!$B$1:$L$111,9,FALSE)","v":"김나경"}]
["3)","대학교 :",{"$f":"VLOOKUP($J$5,전체학교명부!$B$1:$L$111,10,FALSE)","v":"공주대학교"}]
["4)","연락처 :",{"$f":"VLOOKUP($J$5,전체학교명부!$B$1:$L$111,11,FALSE)","v":"010-4411-6103"}]
[]
["위와 같이 대학생 팀에 선정되었음을 알려드립니다."]
["문의사항은 전화 혹은 메일 주시면 감사드리겠습니다."]
[]
[{"$nulls":9},"정민지 연구원","02-559-3915"]

{"sheet":"매칭결과안내문_대학생","index":5,"n_rows":13,"n_cols":11,"rows_kept":13,"cut":false,"hidden":true,"merged":[]}
["안녕하세요."]
["한국과학창의재단 입니다. 저희 재단에 대한 관심과 지원에 먼저 감사드립니다."]
["2015년 대학생과 함께하는 STEAM의 학교 선정 결과를 말씀드리겠습니다."]
[{"$nulls":9},"학교명","연락처"]
["1)","학교명 :",{"$f":"VLOOKUP(J5,전체학교명부!$E$1:$L$111,2,FALSE)","v":"태봉초등학교"},{"$nulls":6},"STEAMER",{"$f":"VLOOKUP(J5,전체학교명부!$E$1:$L$111,8,FALSE)","v":"010-6258-5593"}]
["2)","담당교사 :",{"$f":"VLOOKUP(J5,전체학교명부!$E$1:$L$111,3,FALSE)","v":{"$error":"#REF!"}}]
["3)","연락처 :",{"$f":"VLOOKUP(J5,전체학교명부!$E$1:$L$111,4,FALSE)","v":{"$error":"#REF!"}}]
["4)","주소 :",{"$f":"VLOOKUP(J5,전체학교명부!$E$1:$L$111,5,FALSE)","v":"충남 공주시 원태봉길 57"}]
[]
["위와 같이 2015년 대학생과 함께하는 STEAM 학교에 선정되었음을 알려드립니다."]
["팀장님께 알려드리오니 팀원들에게도 공유 부탁드립니다."]
["문의사항은 전화 혹은 메일 주시면 감사드리겠습니다."]
[{"$nulls":9},"정민지 연구원","02-559-3915"]